Target
Transient receptor potential cation channel subfamily V member 1
Ligand
BDBM127310
Substrate
Meas. Tech.
FLIPR Assay
Ki
0.1±n/a nM
Citation
 Frank, RBahrenberg, GChristoph, TSchiene, KDe Vry, JSaunders, DPrzewosny, MSundermann, BLee, J Vanilloid receptor ligands, pharmaceutical compositions containing them, process for making them, and use thereof for treating pain and other conditions US Patent  US8791268 Publication Date 7/29/2014 
Target
Name:
Transient receptor potential cation channel subfamily V member 1
Synonyms:
Capsaicin receptor Osm-9-like TRP channel 1 TRPV1_HUMAN Transient receptor potential cation channel subfamily V member 1 (TRPV1) Transient receptor potential cation channel subfamily V member 1(TRPV1) Vanilloid VR1 Vanilloid receptor 1 Vanilloid receptor 1 (VRI/TRPV1)
Type:
Protein
Mol. Mass.:
94960.75
Organism:
Homo sapiens (Human)
Description:
Q8NER1
Residue:
839
  
Inhibitor
Name:
BDBM127310
Synonyms:
US8791268, 21
Type:
Small organic molecule
Emp. Form.:
C22H25BrF3N3O3
Mol. Mass.:
516.351
SMILES:
COc1cc(CC(=O)NCc2ccc(nc2N2CCC(C)CC2)C(F)(F)F)cc(Br)c1O
: