Target
Serine/threonine-protein kinase mTOR
Ligand
BDBM127391
Substrate
Meas. Tech.
Biochemical Assay
pH
7.5±n/a
Temperature
298.15±n/a K
Ki
0.822±n/a nM
Comments
extracted
Citation
 Cheng, HJohnson, TWHoffman, JEGuo, LCLiu, Z Imidazo[1,5]naphthyridine compounds, their pharmaceutical use and compositions US Patent  US8791131 Publication Date 7/29/2014 
Target
Name:
Serine/threonine-protein kinase mTOR
Synonyms:
FK506-binding protein 12-rapamycin complex-associated protein 1 FRAP FRAP1 MTOR Mammalian Target of Rapamycin (mTOR) RAFT1 Rapamycin and FKBP12 target 1 Serine/threonine-protein kinase (mTOR) | mTORC2
Type:
Rapamycin target protein
Mol. Mass.:
288917.12
Organism:
Homo sapiens (Human)
Description:
P42345
Residue:
2549
  
Inhibitor
Name:
BDBM127391
Synonyms:
US8791131, 154
Type:
Small organic molecule
Emp. Form.:
C23H25N7O4
Mol. Mass.:
463.4891
SMILES:
COc1ncc(cn1)-c1ccc2ncc3n(C)c(=O)n(C4CCN(CC4)C(=O)[C@H](C)O)c3c2n1
: