Target
Tyrosine-protein kinase JAK2
Ligand
BDBM127657
Substrate
Meas. Tech.
Inhibition Assay
IC50
>1000±n/a nM
Citation
 Allen, SAndrews, SWCondroski, KRHaas, JHuang, LJiang, YKercher, TSeo, J Substituted pyrazolo[1,5-a]pyrimidine compounds as Trk kinase inhibitors US Patent  US8791123 Publication Date 7/29/2014 
Target
Name:
Tyrosine-protein kinase JAK2
Synonyms:
JAK-2 JAK2_HUMAN Janus kinase 2 (JAK2) | Janus kinase 2 (a protein tyrosine kinase)
Type:
Protein
Mol. Mass.:
130684.68
Organism:
Homo sapiens (Human)
Description:
O60674
Residue:
1132
  
Inhibitor
Name:
BDBM127657
Synonyms:
US10251889, Example 30 US8791123, 30 US9796724, Example 30
Type:
Small organic molecule
Emp. Form.:
C17H15F2N5O
Mol. Mass.:
343.3307
SMILES:
NC(=O)c1cnn2ccc(nc12)N1CCC[C@@H]1c1cc(F)ccc1F
: