Target
Leucine-rich repeat serine/threonine-protein kinase 2
Ligand
BDBM127916
Substrate
Meas. Tech.
Lanthascreen Binding Assay
Ki
1±n/a nM
Citation
 Baker-Glenn, CChambers, MChan, BKEstrada, ASweeney, ZK Aminopyrimidine derivatives as LRRK2 modulators US Patent  US8791130 Publication Date 7/29/2014 
Target
Name:
Leucine-rich repeat serine/threonine-protein kinase 2
Synonyms:
Dardarin LRRK2_HUMAN Leucine-rich repeat serine/threonine-protein kinase 2 PARK8
Type:
Protein
Mol. Mass.:
286113.20
Organism:
Homo sapiens (Human)
Description:
Q5S007
Residue:
2527
  
Inhibitor
Name:
BDBM127916
Synonyms:
US8791130, 46
Type:
Small organic molecule
Emp. Form.:
C17H19F3N8O2
Mol. Mass.:
424.3804
SMILES:
CNc1nc(Nc2cc(C)c(cc2OC)-n2nnnc2COC)ncc1C(F)(F)F
: