Target
cAMP and cAMP-inhibited cGMP 3',5'-cyclic phosphodiesterase 10A
Ligand
BDBM127929
Substrate
Meas. Tech.
Inhibition Assay
Temperature
298.15±n/a K
IC50
0.29±n/a nM
Comments
extracted
Citation
 Kehler, JNielsen, JMarigo, MKilburn, JPLanggård, M Tricyclic imidazole compounds as PDE10 inhibitors US Patent  US8796304 Publication Date 8/5/2014 
Target
Name:
cAMP and cAMP-inhibited cGMP 3',5'-cyclic phosphodiesterase 10A
Synonyms:
3',5'-cyclic phosphodiesterase PDE10_HUMAN Phosphodiesterase 10A
Type:
Protein
Mol. Mass.:
88412.52
Organism:
Homo sapiens (Human)
Description:
Q9Y233
Residue:
779
  
Inhibitor
Name:
BDBM127929
Synonyms:
US8796304, 2-[2-(5,8-Dimethyl-[1,2,4]triazolo[1,5-a]pyrazin-2-yl)-ethyl]-7-methoxy-5H-imidazo[2,1-a]isoindole | US9062060, Table 1, Compound 10
Type:
Small organic molecule
Emp. Form.:
C20H20N6O
Mol. Mass.:
360.4124
SMILES:
COc1ccc-2c(Cn3cc(CCc4nc5c(C)ncc(C)n5n4)nc-23)c1
: