Target
Transthyretin
Ligand
BDBM50308499
Substrate
Meas. Tech.
Counterscreen for activators of Transthyretin (TTR) transcription: Luminescence-based cell-based high throughput dose response assay to identify inhibitors of Transthyretin (TTR) transcription in HuH7
IC50
>55162±n/a nM
Citation
 PubChem, PC Counterscreen for activators of Transthyretin (TTR) transcription: Luminescence-based cell-based high throughput dose response assay to identify inhibitors of Transthyretin (TTR) transcription in HuH7 hepatoma cells PubChem Bioassay (2014)[AID] 
Target
Name:
Transthyretin
Synonyms:
ATTR Prealbumin TTHY_HUMAN Transthyretin (TTR)
Type:
Enzyme
Mol. Mass.:
15884.31
Organism:
Homo sapiens (Human)
Description:
P02766
Residue:
147
  
Inhibitor
Name:
BDBM50308499
Synonyms:
CHEMBL602722 cid_7315332
Type:
Small organic molecule
Emp. Form.:
C19H15ClN2O3S
Mol. Mass.:
386.852
SMILES:
CCOC(=O)Nc1nc(c(s1)C(=O)c1ccc(Cl)cc1)-c1ccccc1
: