Target
Leucine-rich repeat serine/threonine-protein kinase 2
Ligand
BDBM128256
Substrate
Meas. Tech.
Lanthascreen Binding Assay
Ki
1±n/a nM
Citation
 Baker-Glenn, CChambers, MChan, BKEstrada, ASweeney, ZK Aminopyrimidine derivatives as LRRK2 modulators US Patent  US8796296 Publication Date 8/5/2014 
Target
Name:
Leucine-rich repeat serine/threonine-protein kinase 2
Synonyms:
Dardarin LRRK2_HUMAN Leucine-rich repeat serine/threonine-protein kinase 2 PARK8
Type:
Protein
Mol. Mass.:
286113.20
Organism:
Homo sapiens (Human)
Description:
Q5S007
Residue:
2527
  
Inhibitor
Name:
BDBM128256
Synonyms:
US8796296, 11
Type:
Small organic molecule
Emp. Form.:
C16H16F3N5O2
Mol. Mass.:
367.3257
SMILES:
CNc1nc(Nc2ccc3C(=O)N(C)Cc3c2OC)ncc1C(F)(F)F
: