Target
Neuraminidase
Ligand
BDBM4772
Substrate
BDBM4702
Meas. Tech.
Neuraminidase Inhibition Assay
IC50
2550±n/a nM
Citation
 Chand, PBabu, YSBantia, SRowland, SDehghani, AKotian, PLHutchison, TLAli, SBrouillette, WEl-Kattan, YLin, TH Syntheses and neuraminidase inhibitory activity of multisubstituted cyclopentane amide derivatives. J Med Chem 47:1919-29 (2004)  
Target
Name:
Neuraminidase
Synonyms:
Influenza A Virus Neuraminidase NRAM_I75A5 | Neuraminidase A
Type:
Enzyme
Mol. Mass.:
52468.81
Organism:
Influenza A virus (N9)
Description:
P03472
Residue:
470
  
Inhibitor
Name:
BDBM4772
Synonyms:
(3S,4S)-3-carbamimidamido-4-[(1S)-1-acetamido-2-(3-methylpiperidin-1-yl)-2-oxoethyl]cyclopentane-1-carboxylic acid | Cyclopentane Amide deriv. 16h
Type:
Small organic molecule
Emp. Form.:
C17H29N5O4
Mol. Mass.:
367.4433
SMILES:
[#6]-[#6]-1-[#6]-[#6]-[#6]-[#7](-[#6]-1)-[#6](=O)-[#6](-[#7]-[#6](-[#6])=O)-[#6@H]-1-[#6]-[#6](-[#6]-[#6@@H]-1\[#7]=[#6](\[#7])-[#7])-[#6](-[#8])=O
:
Substrate
Name:
BDBM4702
Synonyms:
(2R,4S,5R,6R)-5-acetamido-4-hydroxy-2-[(4-methyl-2-oxo-2H-chromen-7-yl)oxy]-6-[(1R,2R)-1,2,3-trihydroxypropyl]oxane-2-carboxylic acid neuraminidase substrate
Type:
Small organic molecule
Emp. Form.:
C21H25NO11
Mol. Mass.:
467.4233
SMILES:
CC(=O)N[C@@H]1[C@@H](O)C[C@](Oc2ccc3c(C)cc(=O)oc3c2)(O[C@H]1[C@H](O)[C@H](O)CO)C(O)=O
: