Target
Fibroblast growth factor receptor 3
Ligand
BDBM128502
Substrate
Meas. Tech.
In Vitro Kinase Inhibition Assay
pH
8±n/a
Temperature
298.15±n/a K
IC50
0.447±n/a nM
Comments
extracted
Citation
 Berdini, VCarr, MGCongreve, MSFrederickson, MGriffiths-Jones, CMHamlett, CCMadin, AMurray, CWBenning, RKSaxty, GVickerstaffe, EWilliams, BJWoodhead, AJWoodhead, SJFreyne, EJGovaerts, TCAngibaud, PR Imidazopyridine derivatives as inhibitors of receptor tyrosine kinases US Patent  US8796244 Publication Date 8/5/2014 
Target
Name:
Fibroblast growth factor receptor 3
Synonyms:
CD_antigen: CD333 FGFR3 Fibroblast growth factor receptor JTK4
Type:
Protein
Mol. Mass.:
87699.57
Organism:
Homo sapiens (Human)
Description:
P22607
Residue:
806
  
Inhibitor
Name:
BDBM128502
Synonyms:
US8796244, 81
Type:
Small organic molecule
Emp. Form.:
C24H24F3N7O2
Mol. Mass.:
499.4883
SMILES:
CC(C)(CO)Nc1ccc(nn1)-c1ccn2c(cnc2c1)-c1cccc(NC(=O)NCC(F)(F)F)c1
: