Target
DNA-dependent protein kinase catalytic subunit
Ligand
BDBM128809
Substrate
Meas. Tech.
Biochemical Assay
pH
7.4±n/a
Temperature
298.15±n/a K
IC50
0.3±n/a nM
Comments
extracted
Citation
 Fuchss, TMederski, WZenke, F Pyrazoloquinolines US Patent  US8802712 Publication Date 8/12/2014 
Target
Name:
DNA-dependent protein kinase catalytic subunit
Synonyms:
DNA-PK catalytic subunit DNA-dependent protein kinase (DNA-PK) DNA-dependent protein kinase catalytic subunit (DNA-PK) HYRC PRKDC | PRKDC_HUMAN
Type:
Protein
Mol. Mass.:
469114.78
Organism:
Homo sapiens (Human)
Description:
P78527
Residue:
4128
  
Inhibitor
Name:
BDBM128809
Synonyms:
US8802712, 67
Type:
Small organic molecule
Emp. Form.:
C21H16N4O4
Mol. Mass.:
388.3761
SMILES:
COc1cc2ncc3n(CC(O)=O)nc(-c4ccc(cc4)C#N)c3c2cc1OC
: