Target
Transient receptor potential cation channel subfamily V member 1
Ligand
BDBM128976
Substrate
Meas. Tech.
FLIPR Assay
IC50
4±n/a nM
Citation
 Gomtsyan, ADaanen, JFGfesser, GAKort, MELee, CMcDonald, HAPuttfarcken, PSVoight, EAKym, PR TRPV1 antagonists US Patent  US8802711 Publication Date 8/12/2014 
Target
Name:
Transient receptor potential cation channel subfamily V member 1
Synonyms:
Capsaicin receptor Osm-9-like TRP channel 1 TRPV1_HUMAN Transient receptor potential cation channel subfamily V member 1 (TRPV1) Transient receptor potential cation channel subfamily V member 1(TRPV1) Vanilloid VR1 Vanilloid receptor 1 Vanilloid receptor 1 (VRI/TRPV1)
Type:
Protein
Mol. Mass.:
94960.75
Organism:
Homo sapiens (Human)
Description:
Q8NER1
Residue:
839
  
Inhibitor
Name:
BDBM128976
Synonyms:
US8802711, A
Type:
Small organic molecule
Emp. Form.:
C22H26N2O2
Mol. Mass.:
350.454
SMILES:
O[C@@H]1CCc2cccc(NC(=O)N[C@H]3CC[C@@H](C3)c3ccccc3)c2C1
: