Target
Leucine-rich repeat serine/threonine-protein kinase 2
Ligand
BDBM129139
Substrate
Meas. Tech.
LabChip Assay
Ki
1.4±n/a nM
Citation
 Baker-Glenn, CBurdick, DJChambers, MChan, BKChen, HEstrada, AGunzner-Tate, JShore, DSweeney, ZKWang, SZhao, G Aminopyrimidine derivatives as LRRK2 modulators US Patent  US8802674 Publication Date 8/12/2014 
Target
Name:
Leucine-rich repeat serine/threonine-protein kinase 2
Synonyms:
Dardarin LRRK2_HUMAN Leucine-rich repeat serine/threonine-protein kinase 2 PARK8
Type:
Protein
Mol. Mass.:
286113.20
Organism:
Homo sapiens (Human)
Description:
Q5S007
Residue:
2527
  
Inhibitor
Name:
BDBM129139
Synonyms:
US8802674, 238
Type:
Small organic molecule
Emp. Form.:
C19H21F4N5O3
Mol. Mass.:
443.3954
SMILES:
CCNc1nc(Nc2cc(OC)c(cc2F)C(=O)N2CCOCC2)ncc1C(F)(F)F
: