Target
Bromodomain-containing protein 4
Ligand
BDBM285059
Substrate
Meas. Tech.
In Vitro Enzyme Inhibition Assay
pH
7.3±n/a
IC50
>5000±n/a nM
Comments
extracted
Citation
 Boloor, A Bromodomain inhibitors US Patent  US10023592 Publication Date 7/17/2018 
Target
Name:
Bromodomain-containing protein 4
Synonyms:
BRD4 Bromodomain-containing protein 4 (BRD4) Protein HUNK1
Type:
Protein
Mol. Mass.:
152264.84
Organism:
Homo sapiens (Human)
Description:
O60885
Residue:
1362
  
Inhibitor
Name:
BDBM285059
Synonyms:
3-amino-1-methyl-5-(3- methylsulfonylphenyl)pyrazin-2-one US10023592, Example 104
Type:
Small organic molecule
Emp. Form.:
C12H13N3O3S
Mol. Mass.:
279.315
SMILES:
Cn1cc(nc(N)c1=O)-c1cccc(c1)S(C)(=O)=O
: