Target
Trace amine-associated receptor 1
Ligand
BDBM129471
Substrate
Meas. Tech.
Radioligand Binding
pH
7.4±n/a
Temperature
310.15±n/a K
Ki
1.1±n/a nM
Comments
extracted
Citation
 Galley, GNorcross, RDPflieger, P Heterocyclic amine derivatives US Patent  US8802673 Publication Date 8/12/2014 
Target
Name:
Trace amine-associated receptor 1
Synonyms:
TAAR1_MOUSE Taar1 Trace amine receptor 1 (TARR1) Trace amine-associated receptor1 | Trar1
Type:
Protein
Mol. Mass.:
37635.41
Organism:
Mus musculus (Mouse)
Description:
Q923Y8
Residue:
332
  
Inhibitor
Name:
BDBM129471
Synonyms:
US8802673, 113
Type:
Small organic molecule
Emp. Form.:
C19H20N4O
Mol. Mass.:
320.3883
SMILES:
C1CO[C@H](CN1)c1ccc(Nc2cc(n[nH]2)-c2ccccc2)cc1
: