Target
Epidermal growth factor receptor
Ligand
BDBM4567
Substrate
poly(E:Y)
Meas. Tech.
Kinase Inhibition Assay
pH
7.4±n/a
Temperature
298.15±n/a K
IC50
0.70±n/a nM
Comments
Irreversible Inhibitor
Citation
 Smaill, JBShowalter, HDZhou, HBridges, AJMcNamara, DJFry, DWNelson, JMSherwood, VVincent, PWRoberts, BJElliott, WLDenny, WA Tyrosine kinase inhibitors. 18. 6-Substituted 4-anilinoquinazolines and 4-anilinopyrido[3,4-d]pyrimidines as soluble, irreversible inhibitors of the epidermal growth factor receptor. J Med Chem 44:429-40 (2001)  
Target
Name:
Epidermal growth factor receptor
Synonyms:
EGF Receptor Substrate EGFR_HUMAN ERBB1 Epidermal Growth Factor Receptor erbB-1 Epidermal growth factor receptor (EGFR) HER1 Proto-oncogene c-ErbB-1 Tyrosine-Protein Kinase ErbB-1
Type:
Receptor Kinase Domain
Mol. Mass.:
134279.59
Organism:
Homo sapiens (Human)
Description:
P00533
Residue:
1210
  
Inhibitor
Name:
BDBM4567
Synonyms:
4-anilinoquinazoline deriv. 2 CHEMBL285063 US9422297, PD168393
Type:
Small organic molecule
Emp. Form.:
C17H13BrN4O
Mol. Mass.:
369.215
SMILES:
Brc1cccc(Nc2ncnc3ccc(NC(=O)C=C)cc23)c1
:
Substrate
Name:
poly(E:Y)
Synonyms:
Type:
Random Polymer
Mol. Mass.:
358.43
Organism:
Description:
Polyglutamic acid/tyrosine (Sigma Chemical Co., St. Louis, MO). 10 uM ATP containing 0.5 uCi of [gamma-32P]ATP as co-substrate.
Residue:
3
NA