Target
Fibroblast growth factor receptor 1
Ligand
BDBM130827
Substrate
Meas. Tech.
Enzyme Inhibition Assay
IC50
230±n/a nM
Citation
 Taka, NOhmori, MTakami, KMatsushita, MHayase, THyodo, IKochi, MNishii, HEbiike, HNakanishi, YMio, TWang, LZhao, W Aminopyrazole derivative US Patent  US8829199 Publication Date 9/9/2014 
Target
Name:
Fibroblast growth factor receptor 1
Synonyms:
BFGFR Basic fibroblast growth factor receptor 1 (FGFR1) CEK FGFR-1 FGFR-1, (FL) FGFR1_HUMAN FLT2 Fibroblast growth factor receptor 1 (FGFR-1) Fms-like tyrosine kinase 2 N-sam bFGF-R | c-fgr
Type:
Receptor
Mol. Mass.:
91861.70
Organism:
Homo sapiens (Human)
Description:
P11362
Residue:
822
  
Inhibitor
Name:
BDBM130827
Synonyms:
US8829199, 68
Type:
Small organic molecule
Emp. Form.:
C24H23N6O
Mol. Mass.:
411.479
SMILES:
CCCCc1ccc2cc([nH]c2c1)C(=O)c1cnn(c1N)-c1ccc2nc(C)nc2c1
: