Target
Fibroblast growth factor receptor 2
Ligand
BDBM130828
Substrate
Meas. Tech.
Enzyme Inhibition Assay
IC50
16±n/a nM
Citation
 Taka, NOhmori, MTakami, KMatsushita, MHayase, THyodo, IKochi, MNishii, HEbiike, HNakanishi, YMio, TWang, LZhao, W Aminopyrazole derivative US Patent  US8829199 Publication Date 9/9/2014 
Target
Name:
Fibroblast growth factor receptor 2
Synonyms:
BEK FGFR-2 FGFR2 Fibroblast growth factor receptor 2 (FGFR2) KGFR Keratinocyte growth factor receptor VEGF-receptor 2 and Fibroblast growth factor receptor 2
Type:
Enzyme
Mol. Mass.:
92015.45
Organism:
Homo sapiens (Human)
Description:
P21802
Residue:
821
  
Inhibitor
Name:
BDBM130828
Synonyms:
US8829199, 69
Type:
Small organic molecule
Emp. Form.:
C24H19N8O
Mol. Mass.:
435.4607
SMILES:
Cc1nc2ccc(cc2n1)-n1ncc(C(=O)c2cc3ccc(cc3[nH]2)-c2cnn(C)c2)c1N
: