Target
Acetyl-CoA carboxylase 2
Ligand
BDBM131352
Substrate
Meas. Tech.
Spectrophotometric 384 Well Assay
pH
7.5±n/a
IC50
280±n/a nM
Comments
extracted
Citation
 Roth, GJFleck, MHeine, NKley, JLehmann-Lintz, TNeubauer, HNosse, B Compounds, pharmaceutical compositions and uses thereof US Patent  US8835472 Publication Date 9/16/2014 
Target
Name:
Acetyl-CoA carboxylase 2
Synonyms:
ACACB ACC-beta ACCB Acetyl-CoA carboxylase 2 Acetyl-CoA carboxylase 2 (ACC2)
Type:
Protein
Mol. Mass.:
276535.21
Organism:
Homo sapiens (Human)
Description:
O00763
Residue:
2458
  
Inhibitor
Name:
BDBM131352
Synonyms:
US8835472, 9.19
Type:
Small organic molecule
Emp. Form.:
C23H27NO3
Mol. Mass.:
365.4654
SMILES:
CCOCCOc1ccc(cc1)C#Cc1ccc(CC(C)NC(C)=O)cc1
: