Target
Serine/threonine-protein kinase ATR
Ligand
BDBM50437437
Substrate
Meas. Tech.
Inhibition Assay
pH
7.5±n/a
Ki
90±0.0 nM
Comments
extracted
Citation
 Charrier, JO'Donnell, MEEveritt, SR Compounds useful as inhibitors of ATR kinase US Patent  US8841450 Publication Date 9/23/2014 
Target
Name:
Serine/threonine-protein kinase ATR
Synonyms:
ATR Ataxia telangiectasia and Rad3-related protein (ATR) FRP1 | Serine-protein kinase ATR
Type:
Protein
Mol. Mass.:
301404.58
Organism:
Homo sapiens (Human)
Description:
Q13535
Residue:
2644
  
Inhibitor
Name:
BDBM50437437
Synonyms:
CHEMBL2409217 | US8841450, I-2
Type:
Small organic molecule
Emp. Form.:
C24H27N5O3S
Mol. Mass.:
465.568
SMILES:
CNCc1ccc(cc1)C1=NOC(C1)c1nc(cnc1N)-c1ccc(cc1)S(=O)(=O)C(C)C
: