Target
Dihydrofolate reductase
Ligand
BDBM50448748
Substrate
Meas. Tech.
Inhibition Assay
Ki
0.6±n/a nM
Citation
 Chen, ZCreighton, CJCunningham, MFinn, JHilgers, MJung, MKohnen, LALam, TLi, XStidham, MTari, LTrzoss, MZhang, J Dihydrofolate reductase inhibitors US Patent  US8835445 Publication Date 9/16/2014 
Target
Name:
Dihydrofolate reductase
Synonyms:
DYR_STAAU Dihydrofolate reductase Tetrahydrofolate dehydrogenase | folA
Type:
Enzyme
Mol. Mass.:
18249.71
Organism:
Staphylococcus aureus
Description:
Residue:
159
  
Inhibitor
Name:
BDBM50448748
Synonyms:
CHEMBL3127917 | US8835445, 19
Type:
Small organic molecule
Emp. Form.:
C21H23N7O
Mol. Mass.:
389.4536
SMILES:
Cc1cc2nc(N3CCOCC3)n(-c3ccc4c(N)nc(N)nc4c3)c2cc1C
: