Target
Dihydrofolate reductase
Ligand
BDBM131854
Substrate
Meas. Tech.
Inhibition Assay
Ki
0.039±n/a nM
Citation
 Chen, ZCreighton, CJCunningham, MFinn, JHilgers, MJung, MKohnen, LALam, TLi, XStidham, MTari, LTrzoss, MZhang, J Dihydrofolate reductase inhibitors US Patent  US8835445 Publication Date 9/16/2014 
Target
Name:
Dihydrofolate reductase
Synonyms:
DYR_STAAU Dihydrofolate reductase Tetrahydrofolate dehydrogenase | folA
Type:
Enzyme
Mol. Mass.:
18249.71
Organism:
Staphylococcus aureus
Description:
Residue:
159
  
Inhibitor
Name:
BDBM131854
Synonyms:
US8835445, 37
Type:
Small organic molecule
Emp. Form.:
C19H15N7O2
Mol. Mass.:
373.3681
SMILES:
COc1ccc2nc(-c3ccco3)n(-c3ccc4c(N)nc(N)nc4c3)c2n1
: