Target
Vascular endothelial growth factor receptor 2
Ligand
BDBM4813
Substrate
poly(E:Y)
Meas. Tech.
Tyrosine Kinase Assay
pH
7.5±n/a
Temperature
295.15±n/a K
IC50
50±n/a nM
Citation
 Sun, LLiang, CShirazian, SZhou, YMiller, TCui, JFukuda, JYChu, JYNematalla, AWang, XChen, HSistla, ALuu, TCTang, FWei, JTang, C Discovery of 5-[5-fluoro-2-oxo-1,2- dihydroindol-(3Z)-ylidenemethyl]-2,4- dimethyl-1H-pyrrole-3-carboxylic acid (2-diethylaminoethyl)amide, a novel tyrosine kinase inhibitor targeting vascular endothelial and platelet-derived growth factor receptor tyrosine kinase. J Med Chem 46:1116-9 (2003)  
Target
Name:
Vascular endothelial growth factor receptor 2
Synonyms:
CD_antigen=CD309 Fetal liver kinase 1 (FLK-1) KDR Protein-tyrosine kinase receptor Flk-1 VEGFR-2 VEGFR2 Vascular Endothelial Growth Factor Receptor Kinase 2 Vascular endothelial growth factor receptor 2 (KDR) Vascular endothelial growth factor receptor 2 (VEGFR2) Vascular endothelial growth factor receptor-2 (VEGFR-2)
Type:
Receptor Tyrosine Kinase
Mol. Mass.:
151510.97
Organism:
Homo sapiens (Human)
Description:
P35968
Residue:
1356
  
Inhibitor
Name:
BDBM4813
Synonyms:
N-[2-(diethylamino)ethyl]-2,4-dimethyl-5-{[(3Z)-2-oxo-2,3-dihydro-1H-indol-3-ylidene]methyl}-1H-pyrrole-3-carboxamide | SU11248 analog 12a
Type:
Small organic molecule
Emp. Form.:
C22H28N4O2
Mol. Mass.:
380.4833
SMILES:
CCN(CC)CCNC(=O)c1c(C)[nH]c(\C=C2/C(=O)Nc3ccccc23)c1C
:
Substrate
Name:
poly(E:Y)
Synonyms:
Type:
Random Polymer
Mol. Mass.:
358.43
Organism:
Description:
a polyGlu-Tyr peptide (4:1)(Sigma P-0275). 10 uM ATP as co-substrate.
Residue:
3
NA