Target
Cholinesterase
Ligand
BDBM132074
Substrate
Meas. Tech.
Inhibition Assay
IC50
0.38±n/a nM
Citation
 Zawadzka, ACzarnocki, ZLozinska, IMoleda, ZPanasiewicz, M Hybrid cholinesterase inhibitors US Patent  US8841453 Publication Date 9/23/2014 
Target
Name:
Cholinesterase
Synonyms:
Acylcholine acylhydrolase Butyrylcholine esterase (BChE) Butyrylcholinesterase (BuChE) CHLE_HUMAN Cholinesterases Pseudocholinesterase
Type:
Homotetramer
Mol. Mass.:
68422.27
Organism:
Homo sapiens (Human)
Description:
P06276
Residue:
602
  
Inhibitor
Name:
BDBM132074
Synonyms:
US8841453, 4
Type:
Small organic molecule
Emp. Form.:
C33H40ClN5O3
Mol. Mass.:
590.155
SMILES:
CC(=O)NCCc1c[nH]c2ccc(OC(=O)NCCCCCCCNc3c4CCCCc4nc4cc(Cl)ccc34)cc12
: