Target
Cholinesterase
Ligand
BDBM132083
Substrate
Meas. Tech.
Inhibition Assay
IC50
0.28±n/a nM
Citation
 Zawadzka, ACzarnocki, ZLozinska, IMoleda, ZPanasiewicz, M Hybrid cholinesterase inhibitors US Patent  US8841453 Publication Date 9/23/2014 
Target
Name:
Cholinesterase
Synonyms:
Acylcholine acylhydrolase Butyrylcholine esterase (BChE) Butyrylcholinesterase (BuChE) CHLE_HUMAN Cholinesterases Pseudocholinesterase
Type:
Homotetramer
Mol. Mass.:
68422.27
Organism:
Homo sapiens (Human)
Description:
P06276
Residue:
602
  
Inhibitor
Name:
BDBM132083
Synonyms:
US8841453, 14
Type:
Small organic molecule
Emp. Form.:
C36H47N5O3
Mol. Mass.:
597.7901
SMILES:
CC(=O)NCCc1c[nH]c2ccc(OC(=O)NCCCCCCCCCCNc3c4CCCCc4nc4ccccc34)cc12
: