Target
Cholinesterase
Ligand
BDBM132086
Substrate
Meas. Tech.
Inhibition Assay
IC50
1.2±n/a nM
Citation
 Zawadzka, ACzarnocki, ZLozinska, IMoleda, ZPanasiewicz, M Hybrid cholinesterase inhibitors US Patent  US8841453 Publication Date 9/23/2014 
Target
Name:
Cholinesterase
Synonyms:
Acylcholine acylhydrolase Butyrylcholine esterase (BChE) Butyrylcholinesterase (BuChE) CHLE_HUMAN Cholinesterases Pseudocholinesterase
Type:
Homotetramer
Mol. Mass.:
68422.27
Organism:
Homo sapiens (Human)
Description:
P06276
Residue:
602
  
Inhibitor
Name:
BDBM132086
Synonyms:
US8841453, 18
Type:
Small organic molecule
Emp. Form.:
C36H46ClN5O3
Mol. Mass.:
632.235
SMILES:
CC(=O)NCCc1c[nH]c2ccc(OC(=O)NCCCCCCCCCCNc3c4CCCCc4nc4cc(Cl)ccc34)cc12
: