Target
Cyclin-dependent kinase 6
Ligand
BDBM50001585
Substrate
Meas. Tech.
In Vitro Assay
pH
7.4±n/a
Temperature
310.15±n/a K
IC50
17±n/a nM
Citation
 Connors, RVKang, DEksterowicz, JFan, PFisher, BFu, JLi, KLi, ZMcGee, LRSharma, RWang, XMcMinn, DLMihalic, JTDeignan, J Fused pyridine, pyrimidine and triazine compounds as cell cycle inhibitors US Patent  US8841312 Publication Date 9/23/2014 
Target
Name:
Cyclin-dependent kinase 6
Synonyms:
CDK6 CDKN6 Cyclin-dependent kinase 6 (CDK 6) | Serine/threonine-protein kinase PLSTIRE
Type:
Enzyme Subunit
Mol. Mass.:
36937.42
Organism:
Homo sapiens (Human)
Description:
Q00534
Residue:
326
  
Inhibitor
Name:
BDBM50001585
Synonyms:
CHEMBL3237443 | US8841312, 57
Type:
Small organic molecule
Emp. Form.:
C23H25FN8
Mol. Mass.:
432.4966
SMILES:
Fc1nccc2c3cnc(Nc4ccc(cn4)N4CCNCC4)nc3n(C3CCCC3)c12
: