Target
cAMP-specific 3',5'-cyclic phosphodiesterase 4B [122-736,S654A]
Ligand
BDBM285538
Substrate
Meas. Tech.
The PDE4A3, PDE4B1, PDE4C1 and PDE4D3 assays
IC50
1.60±n/a nM
Citation
 Chappie, TAPatel, NCHayward, MMHelal, CJSciabola, SLaChapelle, EAYoung, JMVerhoest, PR Imidazopyridazine compounds US Patent  US10077269 Publication Date 9/18/2018 
Target
Name:
cAMP-specific 3',5'-cyclic phosphodiesterase 4B [122-736,S654A]
Synonyms:
DPDE4 PDE4B1 cAMP-specific 3',5'-cyclic phosphodiesterase 4B
Type:
Enzyme Catalytic Domain
Mol. Mass.:
70253.85
Organism:
Homo sapiens (Human)
Description:
Q07343[122-736,S654A]
Residue:
615
  
Inhibitor
Name:
BDBM285538
Synonyms:
N-cyclopropyl-3-(3,4-di-chlorophenyl)imidazo[1,2-b]pyridazine-2-carboxamide US10669279, Example 11 | US9598421, Example 11
Type:
Small organic molecule
Emp. Form.:
C16H12Cl2N4O
Mol. Mass.:
347.199
SMILES:
Clc1ccc(cc1Cl)-c1c(nc2cccnn12)C(=O)NC1CC1
: