Target
Focal adhesion kinase 1
Ligand
BDBM134136
Substrate
Meas. Tech.
Enzyme Assay
pH
7.5±n/a
IC50
1±n/a nM
Comments
extracted
Citation
 Stadtmueller, HSapountzis, I Substituted pyrimidines for the treatment of diseases such as cancer US Patent  US8846689 Publication Date 9/30/2014 
Target
Name:
Focal adhesion kinase 1
Synonyms:
FADK 1 FAK1 FLT4 Focal adhesion kinase (FAK) Focal adhesion kinase 1 (FAK) Focal adhesion kinase-related nonkinase PTK2 Protein-tyrosine kinase 2 p125FAK | pp125FAK
Type:
Tyrosine-protein kinase
Mol. Mass.:
119233.17
Organism:
Homo sapiens (Human)
Description:
Q05397
Residue:
1052
  
Inhibitor
Name:
BDBM134136
Synonyms:
US8846689, 138
Type:
Small organic molecule
Emp. Form.:
C29H31F3N6O4
Mol. Mass.:
584.5894
SMILES:
COc1cc(C(=O)N[C@H]2CCCN(C)C2)c(C)cc1Nc1ncc(c(Oc2cccc3CN(C)C(=O)c23)n1)C(F)(F)F
: