Target
Focal adhesion kinase 1
Ligand
BDBM134146
Substrate
Meas. Tech.
Enzyme Assay
pH
7.5±n/a
IC50
1±n/a nM
Comments
extracted
Citation
 Stadtmueller, HSapountzis, I Substituted pyrimidines for the treatment of diseases such as cancer US Patent  US8846689 Publication Date 9/30/2014 
Target
Name:
Focal adhesion kinase 1
Synonyms:
FADK 1 FAK1 FLT4 Focal adhesion kinase (FAK) Focal adhesion kinase 1 (FAK) Focal adhesion kinase-related nonkinase PTK2 Protein-tyrosine kinase 2 p125FAK | pp125FAK
Type:
Tyrosine-protein kinase
Mol. Mass.:
119233.17
Organism:
Homo sapiens (Human)
Description:
Q05397
Residue:
1052
  
Inhibitor
Name:
BDBM134146
Synonyms:
US8846689, 148
Type:
Small organic molecule
Emp. Form.:
C28H30ClFN6O4
Mol. Mass.:
569.027
SMILES:
COc1cc(C(=O)NC2CCN(C)CC2)c(F)cc1Nc1ncc(Cl)c(Oc2cccc3[C@@H](C)N(C)C(=O)c23)n1
: