Target
Focal adhesion kinase 1
Ligand
BDBM134158
Substrate
Meas. Tech.
Enzyme Assay
pH
7.5±n/a
IC50
1±n/a nM
Comments
extracted
Citation
 Stadtmueller, HSapountzis, I Substituted pyrimidines for the treatment of diseases such as cancer US Patent  US8846689 Publication Date 9/30/2014 
Target
Name:
Focal adhesion kinase 1
Synonyms:
FADK 1 FAK1 FLT4 Focal adhesion kinase (FAK) Focal adhesion kinase 1 (FAK) Focal adhesion kinase-related nonkinase PTK2 Protein-tyrosine kinase 2 p125FAK | pp125FAK
Type:
Tyrosine-protein kinase
Mol. Mass.:
119233.17
Organism:
Homo sapiens (Human)
Description:
Q05397
Residue:
1052
  
Inhibitor
Name:
BDBM134158
Synonyms:
US8846689, 160
Type:
Small organic molecule
Emp. Form.:
C28H29Cl2FN6O4
Mol. Mass.:
603.472
SMILES:
COc1cc(C(=O)N[C@H]2CCN(C)C[C@H]2F)c(Cl)cc1Nc1ncc(Cl)c(Oc2cccc3[C@@H](C)N(C)C(=O)c23)n1
: