Target
Focal adhesion kinase 1
Ligand
BDBM134208
Substrate
Meas. Tech.
Enzyme Assay
pH
7.5±n/a
IC50
1±n/a nM
Comments
extracted
Citation
 Stadtmueller, HSapountzis, I Substituted pyrimidines for the treatment of diseases such as cancer US Patent  US8846689 Publication Date 9/30/2014 
Target
Name:
Focal adhesion kinase 1
Synonyms:
FADK 1 FAK1 FLT4 Focal adhesion kinase (FAK) Focal adhesion kinase 1 (FAK) Focal adhesion kinase-related nonkinase PTK2 Protein-tyrosine kinase 2 p125FAK | pp125FAK
Type:
Tyrosine-protein kinase
Mol. Mass.:
119233.17
Organism:
Homo sapiens (Human)
Description:
Q05397
Residue:
1052
  
Inhibitor
Name:
BDBM134208
Synonyms:
US8846689, 210
Type:
Small organic molecule
Emp. Form.:
C29H31F3N6O5
Mol. Mass.:
600.5888
SMILES:
CO[C@H]1CN(C)CC[C@@H]1NC(=O)c1ccc(Nc2ncc(c(Oc3cccc4CN(C)C(=O)c34)n2)C(F)(F)F)c(OC)c1
: