Target
High affinity nerve growth factor receptor
Ligand
BDBM134706
Substrate
Meas. Tech.
Enzyme Assay
IC50
3100±n/a nM
Citation
 Andrews, MDBagal, SKGibson, KROmoto, KRyckmans, TSkerratt, SEStupple, PA Pyrrolo[2,3-d]pyrimidine tropomysin-related kinase inhibitors US Patent  US8846698 Publication Date 9/30/2014 
Target
Name:
High affinity nerve growth factor receptor
Synonyms:
2.7.10.1 NTRK1 NTRK1_HUMAN Neurotrophic tyrosine kinase receptor type 1 Synonyms=MTC TRK1-transforming tyrosine kinase protein TRKA GN Tropomyosin alpha-3 chain/High affinity nerve growth factor receptor Tropomyosin-related kinase A (TrkA) Tyrosine kinase receptor (Trk) Tyrosine kinase receptor A (Trk A) Tyrosine kinase receptor A (TrkA) p140-TrkA
Type:
Mol. Mass.:
87498.18
Organism:
Homo sapiens (Human)
Description:
P04629
Residue:
796
  
Inhibitor
Name:
BDBM134706
Synonyms:
US8846698, 169
Type:
Small organic molecule
Emp. Form.:
C22H16F3N5O2
Mol. Mass.:
439.3899
SMILES:
Cn1cc(C(=O)c2cncc(NC(=O)Cc3ccccc3C(F)(F)F)c2)c2cncnc12
: