Target
E3 ubiquitin-protein ligase Mdm2
Ligand
BDBM135147
Substrate
Meas. Tech.
FRET Assay
IC50
1±n/a nM
Citation
 Christopher, MPFradera Llinas, FXMachacek, MMartinez, MReutershan, MHShizuka, MSun, BThompson, CFTrotter, BWVoss, MEAltman, MDBogen, SLDoll, RJ Substituted imidazopyridines as HDM2 inhibitors US Patent  US8846657 Publication Date 9/30/2014 
Target
Name:
E3 ubiquitin-protein ligase Mdm2
Synonyms:
Double minute 2 protein E3 ubiquitin-protein ligase Mdm2 (p53-binding protein Mdm2) Human Double Minute 2 (HDM2) MDM2-MDMX p53-Binding Protein MDM2 | p53-binding protein
Type:
Oncoprotein
Mol. Mass.:
55196.54
Organism:
Homo sapiens (Human)
Description:
Q00987
Residue:
491
  
Inhibitor
Name:
BDBM135147
Synonyms:
US8846657, 3.39
Type:
Small organic molecule
Emp. Form.:
C25H27ClF3N5O2
Mol. Mass.:
521.962
SMILES:
C[C@H]1CC[C@H](Cn2c(nc3cc(nc(-c4cncc(Cl)c4)c23)C(O)=O)N2CCC[C@H]2C(F)(F)F)CC1
: