Target
Cannabinoid receptor 2
Ligand
BDBM135859
Substrate
Meas. Tech.
Radioligand Binding Assay
pH
7.4±n/a
Ki
14±n/a nM
Comments
extracted
Citation
 Carroll, WADart, MJFrost, JMLatshaw, SPKolasa, TLi, TPeddi, SLiu, BPerez-Medrano, APatel, MWang, XNelson, DW Compounds as cannabinoid receptor ligands US Patent  US8859596 Publication Date 10/14/2014 
Target
Name:
Cannabinoid receptor 2
Synonyms:
CANNABINOID CB2 CB2 Cannabinoid CB2 receptor Cnr2 | rCB2
Type:
Enzyme
Mol. Mass.:
39366.68
Organism:
Rattus norvegicus (Rat)
Description:
Q9QZN9
Residue:
360
  
Inhibitor
Name:
BDBM135859
Synonyms:
US8859596, 146
Type:
Small organic molecule
Emp. Form.:
C24H33F3N4O2
Mol. Mass.:
466.5396
SMILES:
Cn1c(c\c(=N\C(=O)c2cc(ccc2ONC(C)(C)C)C(F)(F)F)n1CC1CC1)C(C)(C)C
: