Target
Hematopoietic prostaglandin D synthase
Ligand
BDBM136517
Substrate
Meas. Tech.
Inhibition Assay
pH
8±n/a
Temperature
298.15±n/a K
IC50
54±n/a nM
Comments
extracted
Citation
 Urade, YKitade, MShigeno, KYamane, KTanaka, K Piperazine compound capable of inhibiting prostaglandin D synthase US Patent  US8865714 Publication Date 10/21/2014 
Target
Name:
Hematopoietic prostaglandin D synthase
Synonyms:
GSTS Glutathione-requiring prostaglandin D synthase HPGDS Hematopoietic prostaglandin D synthase Hematopoietic prostaglandin D synthase (HPGDS) PTGDS2 Prostaglandin D Synthase
Type:
Enzyme
Mol. Mass.:
23341.07
Organism:
Homo sapiens (Human)
Description:
The protein was expressed in E. coli strain BL21(DE3) with an N-terminal 6-His tag.
Residue:
199
  
Inhibitor
Name:
BDBM136517
Synonyms:
US8865714, 4
Type:
Small organic molecule
Emp. Form.:
C27H38N6O3
Mol. Mass.:
494.629
SMILES:
Cn1cccc1C(=O)N1CCN(CC1)C(=O)Nc1ccc(cc1)N1CCC(CN2CCOCC2)CC1
: