Target
Beta-secretase 1
Ligand
BDBM136761
Substrate
Meas. Tech.
TR-FRET Assay
pH
9.2±n/a
IC50
22±n/a nM
Comments
extracted
Citation
 Csjernyik, GKarlstrom, SKers, AKolmodin, KNylof, MOhberg, LRakos, LSandberg, LSehgelmeble, FSoderman, PSwahn, BVon Berg, S Compounds and their use as BACE inhibitors US Patent  US8865911 Publication Date 10/21/2014 
Target
Name:
Beta-secretase 1
Synonyms:
ASP2 Aspartyl protease 2 BACE1 Beta-secretase (BACE) Beta-secretase 1 (BACE 1) Beta-secretase 1 (BACE1) Beta-site amyloid precursor protein cleaving enzyme 1 Memapsin-2 beta-Secretase (BACE-1) | beta-Secretase (BACE1)
Type:
Protein
Mol. Mass.:
55755.10
Organism:
Homo sapiens (Human)
Description:
P56817
Residue:
501
  
Inhibitor
Name:
BDBM136761
Synonyms:
US10231967, Example 20u US9000182, 10 | US9918985, Example 20u
Type:
Small organic molecule
Emp. Form.:
C21H26F3N3O2
Mol. Mass.:
409.4452
SMILES:
CO[C@H]1CC[C@@]2(Cc3ccc(OCCC(F)(F)F)cc3C22N=C(C)C(N)=N2)CC1
: