Target
Beta-secretase 1
Ligand
BDBM136904
Substrate
Meas. Tech.
TR-FRET Assay
pH
9.2±n/a
IC50
748±n/a nM
Comments
extracted
Citation
 Csjernyik, GKarlstrom, SKers, AKolmodin, KNylof, MOhberg, LRakos, LSandberg, LSehgelmeble, FSoderman, PSwahn, BVon Berg, S Compounds and their use as BACE inhibitors US Patent  US8865911 Publication Date 10/21/2014 
Target
Name:
Beta-secretase 1
Synonyms:
ASP2 Aspartyl protease 2 BACE1 Beta-secretase (BACE) Beta-secretase 1 (BACE 1) Beta-secretase 1 (BACE1) Beta-site amyloid precursor protein cleaving enzyme 1 Memapsin-2 beta-Secretase (BACE-1) | beta-Secretase (BACE1)
Type:
Protein
Mol. Mass.:
55755.10
Organism:
Homo sapiens (Human)
Description:
P56817
Residue:
501
  
Inhibitor
Name:
BDBM136904
Synonyms:
US10231967, Example 129 US9918985, Example 129
Type:
Small organic molecule
Emp. Form.:
C23H23ClF2N4
Mol. Mass.:
428.905
SMILES:
CC1=NC2(N=C1N)c1cc(ccc1CC21CCC(CC1)C(F)F)-c1cncc(Cl)c1
: