Target
Fatty acid synthase
Ligand
BDBM50426429
Substrate
Meas. Tech.
Biochemical Assay
IC50
70±n/a nM
Citation
 Oslob, JDMcDowell, RSJohnson, RYang, HEvanchik, MZaharia, CACai, HHu, LW Heterocyclic modulators of lipid synthesis US Patent  US8871790 Publication Date 10/28/2014 
Target
Name:
Fatty acid synthase
Synonyms:
FAS FAS_HUMAN HU FASN
Type:
Enzyme
Mol. Mass.:
273419.37
Organism:
Homo sapiens (Human)
Description:
P49327
Residue:
2511
  
Inhibitor
Name:
BDBM50426429
Synonyms:
CHEMBL2322364
Type:
Small organic molecule
Emp. Form.:
C30H30N6O
Mol. Mass.:
490.5988
SMILES:
Cc1cc(C)c(cc1C(=O)N1CCC(CC1)c1ccc(cc1)C#N)-c1nc2nc(ccc2[nH]1)N1CCC1
: