Target
[Pyruvate dehydrogenase (acetyl-transferring)] kinase isozyme 2, mitochondrial
Ligand
BDBM137946
Substrate
Meas. Tech.
Inhibition Assay
pH
8±n/a
Temperature
303.15±n/a K
IC50
27±n/a nM
Comments
extracted
Citation
 Motomura, TNagamori, HSuzawa, KIto, HMorita, TKobayashi, SShinkai, H Fluorene compound and pharmaceutical use thereof US Patent  US8871934 Publication Date 10/28/2014 
Target
Name:
[Pyruvate dehydrogenase (acetyl-transferring)] kinase isozyme 2, mitochondrial
Synonyms:
PDHK2 PDK2_HUMAN Pyruvate dehydrogenase kinase isoenzyme 1 (PDK2)
Type:
Enzyme
Mol. Mass.:
46153.78
Organism:
Homo sapiens (Human)
Description:
Q15119
Residue:
407
  
Inhibitor
Name:
BDBM137946
Synonyms:
US8871934, 539 | US8871934, 799
Type:
Small organic molecule
Emp. Form.:
C22H19F3N2O3
Mol. Mass.:
416.3931
SMILES:
Cc1cc2c(-c3ccccc3C2(O)C(F)(F)F)c(c1)-c1cnn(CCCC(O)=O)c1
: