Target
Histone deacetylase 8
Ligand
BDBM19149
Substrate
Meas. Tech.
Fluor de Lys Assay
Temperature
298.15±n/a K
IC50
232±n/a nM
Comments
extracted
Citation
 Oyelere, ATapadar, S Non-peptide macrocyclic histone deacetylese (HDAC) inhibitors and methods of making and using thereof US Patent  US8871728 Publication Date 10/28/2014 
Target
Name:
Histone deacetylase 8
Synonyms:
HD8 HDAC8_HUMAN Histone deacetylase 8 (HDAC-8) | Human HDAC8
Type:
Enzyme
Mol. Mass.:
41749.60
Organism:
Homo sapiens (Human)
Description:
Q9BY41
Residue:
377
  
Inhibitor
Name:
BDBM19149
Synonyms:
CHEMBL98 SAHA US10188756, Compound SAHA US11505523, Compound SAHA US9353061, SAHA US9695181, Vorinostat Zolinza suberoylanilide hydroxamic acid
Type:
Small organic molecule
Emp. Form.:
C14H20N2O3
Mol. Mass.:
264.3202
SMILES:
ONC(=O)CCCCCCC(=O)Nc1ccccc1
: