Target
Vascular endothelial growth factor receptor 1
Ligand
BDBM4875
Substrate
polyGluTyr
Meas. Tech.
Kinase Inhibition Assay
IC50
80±n/a nM
Citation
 Bold, GAltmann, KHFrei, JLang, MManley, PWTraxler, PWietfeld, BBruggen, JBuchdunger, ECozens, RFerrari, SFuret, PHofmann, FMartiny-Baron, GMestan, JRosel, JSills, MStover, DAcemoglu, FBoss, EEmmenegger, RLasser, LMasso, ERoth, RSchlachter, CVetterli, W New anilinophthalazines as potent and orally well absorbed inhibitors of the VEGF receptor tyrosine kinases useful as antagonists of tumor-driven angiogenesis. J Med Chem 43:2310-23 (2000)  
Target
Name:
Vascular endothelial growth factor receptor 1
Synonyms:
FLT FRT Fms-like tyrosine kinase 1 Tyrosine-protein kinase FRT VEGFR-1 VGFR1_HUMAN Vascular endothelial growth factor receptor 1 (FLT1) Vascular endothelial growth factor receptor 1 and 2 (Flt-1 and KDR) Vascular permeability factor receptor vascular endothelial growth factor/vascular permeability factor receptor
Type:
Receptor Tyrosine Kinase
Mol. Mass.:
150800.23
Organism:
Homo sapiens (Human)
Description:
P17948
Residue:
1338
  
Inhibitor
Name:
BDBM4875
Synonyms:
1-(3-Hydroxyanilino)-4-(4-pyridylmethyl)phthalazine CGP79787 Analog 60
Type:
Small organic molecule
Emp. Form.:
C20H16N4O
Mol. Mass.:
328.3672
SMILES:
Oc1cccc(Nc2nnc(Cc3ccncc3)c3ccccc23)c1
:
Substrate
Name:
polyGluTyr
Synonyms:
Type:
Peptide
Mol. Mass.:
358.43
Organism:
Description:
polyGluTyr(4:1). 8 uM ATP and 0.2 uCi [gamma-33P]ATP as co-substrate.
Residue:
3
NA