Target
Cannabinoid receptor 2
Ligand
BDBM139887
Substrate
Meas. Tech.
Radioligand Binding Assays
Ki
1.1±n/a nM
Citation
 Frost, JMLatshaw, SPDart, MJCarroll, WAPerez-Medrano, AKolasa, TPatel, MVNelson, DWLi, TPeddi, SWang, XLiu, B Compounds as cannabinoid receptor ligands US Patent  US8895592 Publication Date 11/25/2014 
Target
Name:
Cannabinoid receptor 2
Synonyms:
CANNABINOID CB2 CB2 Cannabinoid CB2 receptor Cnr2 | rCB2
Type:
Enzyme
Mol. Mass.:
39366.68
Organism:
Rattus norvegicus (Rat)
Description:
Q9QZN9
Residue:
360
  
Inhibitor
Name:
BDBM139887
Synonyms:
US8895592, 17
Type:
Small organic molecule
Emp. Form.:
C22H24F3N3O2S
Mol. Mass.:
451.505
SMILES:
CC(C)(C)c1cn(CCC(F)(F)F)\c(=N\C(=O)c2cc(ccc2OC2CCC2)C#N)s1
: