Target
Interleukin-6
Ligand
BDBM19190
Substrate
Meas. Tech.
Fluorescence Polarization Ligand Binding Assay
IC50
4.2±n/a nM
Citation
 Rucker, PVSnyder, JS Tricyclic compounds, compositions, and methods US Patent  US8901310 Publication Date 12/2/2014 
Target
Name:
Interleukin-6
Synonyms:
B-cell stimulatory factor 2 CDF Hybridoma growth factor IFNB2 IL6 Interferon beta-2
Type:
Mol. Mass.:
23717.96
Organism:
Homo sapiens (Human)
Description:
P05231
Residue:
212
  
Inhibitor
Name:
BDBM19190
Synonyms:
(1S,2R,10S,11S,14R,15S,17S)-14,17-dihydroxy-14-(2-hydroxyacetyl)-2,15-dimethyltetracyclo[8.7.0.0^{2,7}.0^{11,15}]heptadeca-3,6-dien-5-one Delta-Cortef Prednisolone | US10196374, Prednisolone
Type:
Steroid
Emp. Form.:
C21H28O5
Mol. Mass.:
360.444
SMILES:
[H][C@@]12CC[C@](O)(C(=O)CO)[C@@]1(C)C[C@H](O)[C@@]1([H])[C@@]2([H])CCC2=CC(=O)C=C[C@]12C
: