Target
Alcohol dehydrogenase class-3
Ligand
BDBM47043
Substrate
Meas. Tech.
Binding Assay
pH
7.4±n/a
Temperature
295.15±n/a K
IC50
35±n/a nM
Comments
extracted
Citation
 Sun, XQiu, J Dihydropyrimidin-2(1H)-one compounds as neurokinin-3 receptor antagonists US Patent  US8906933 Publication Date 12/9/2014 
Target
Name:
Alcohol dehydrogenase class-3
Synonyms:
1.1.1.- 1.1.1.284 ADHX Alcohol dehydrogenase 5 Alcohol dehydrogenase class-3 FALDH Glutathione-dependent formaldehyde dehydrogenase (GSH-FDH) alcohol dehydrogenase 3 (ADH-3)
Type:
Mol. Mass.:
39728.34
Organism:
Homo sapiens (Human)
Description:
P11766
Residue:
374
  
Inhibitor
Name:
BDBM47043
Synonyms:
US8906933, (S)-4-(3-ethoxy-4-hydroxy-5-nitrophenyl)-6-(1-methyl-1H-pyrazol-3-yl)-5-(thiophen-3-yl)-3,4-dihydropyrimidin-2(1H)-one
Type:
Emp. Form.:
C20H19N5O5S
Mol. Mass.:
441.46
SMILES:
CCOc1cc(cc(c1O)[N+]([O-])=O)[C@@H]1NC(=O)NC(c2ccn(C)n2)=C1c1ccsc1
: