Target
Epidermal growth factor receptor
Ligand
BDBM140985
Substrate
Meas. Tech.
In Vitro Kinase Assay
Temperature
298.15±n/a K
IC50
52.67±n/a nM
Comments
extracted
Citation
 Wang, JFan, CZhang, LGuo, ZLi, YYang, SYan, SZhu, JYang, QZhang, M 4-(substituted anilino)-quinazoline derivatives useful as tyrosine kinase inhibitors US Patent  US8916574 Publication Date 12/23/2014 
Target
Name:
Epidermal growth factor receptor
Synonyms:
EGF Receptor Substrate EGFR_HUMAN ERBB1 Epidermal Growth Factor Receptor erbB-1 Epidermal growth factor receptor (EGFR) HER1 Proto-oncogene c-ErbB-1 Tyrosine-Protein Kinase ErbB-1
Type:
Receptor Kinase Domain
Mol. Mass.:
134279.59
Organism:
Homo sapiens (Human)
Description:
P00533
Residue:
1210
  
Inhibitor
Name:
BDBM140985
Synonyms:
US8916574, Compound 2
Type:
Small organic molecule
Emp. Form.:
C29H26ClFN4O3S
Mol. Mass.:
565.058
SMILES:
CS(=O)CCNCc1ccc(o1)-c1ccc2ncnc(Nc3ccc(OCc4cccc(F)c4)c(Cl)c3)c2c1
: