Target
Plasma kallikrein
Ligand
BDBM141388
Substrate
Meas. Tech.
Enzyme Assay
pH
8±n/a
Ki
8.9±n/a nM
Comments
extracted
Citation
 Steinmetzer, TSaupe, SM Serine protease inhibitors US Patent  US8921319 Publication Date 12/30/2014 
Target
Name:
Plasma kallikrein
Synonyms:
Fletcher factor KLKB1 Kallikrein Plasma kallikrein heavy chain Plasma prekallikrein
Type:
Protein
Mol. Mass.:
71391.16
Organism:
Homo sapiens (Human)
Description:
P03952
Residue:
638
  
Inhibitor
Name:
BDBM141388
Synonyms:
US8921319, 7
Type:
Small organic molecule
Emp. Form.:
C45H47N7O6S
Mol. Mass.:
813.963
SMILES:
NC(=N)c1ccc(CNC(=O)[C@@H]2Cc3cccc(CNC(=O)Cc4ccccc4CC(=O)NCc4cccc(C[C@@H](NS(=O)(=O)Cc5ccccc5)C(=O)N2)c4)c3)cc1
: