Target
Prothrombin
Ligand
BDBM50380625
Substrate
Meas. Tech.
Enzyme Assay
pH
8±n/a
Ki
510±n/a nM
Comments
extracted
Citation
 Steinmetzer, TSaupe, SM Serine protease inhibitors US Patent  US8921319 Publication Date 12/30/2014 
Target
Name:
Prothrombin
Synonyms:
Activation peptide fragment 1 Coagulation factor II Prothrombin precursor Thrombin heavy chain | Thrombin light chain
Type:
Protein
Mol. Mass.:
70029.57
Organism:
Homo sapiens (Human)
Description:
P00734
Residue:
622
  
Inhibitor
Name:
BDBM50380625
Synonyms:
CHEMBL2016872
Type:
Small organic molecule
Emp. Form.:
C37H41N5O6S
Mol. Mass.:
683.816
SMILES:
NC(=N)c1ccc(CNC(=O)[C@@H]2Cc3ccc(OCCCCOc4ccc(C[C@@H](NS(=O)(=O)Cc5ccccc5)C(=O)N2)cc4)cc3)cc1
: