Target
Coagulation factor X
Ligand
BDBM141388
Substrate
Meas. Tech.
Enzyme Assay
pH
8±n/a
Ki
103±n/a nM
Comments
extracted
Citation
 Steinmetzer, TSaupe, SM Serine protease inhibitors US Patent  US8921319 Publication Date 12/30/2014 
Target
Name:
Coagulation factor X
Synonyms:
Activated coagulation factor X (FXa) Coagulation factor X precursor F10 Factor X heavy chain Factor Xa Stuart-Prower factor
Type:
Enzyme
Mol. Mass.:
54726.60
Organism:
Homo sapiens (Human)
Description:
Residue:
488
  
Inhibitor
Name:
BDBM141388
Synonyms:
US8921319, 7
Type:
Small organic molecule
Emp. Form.:
C45H47N7O6S
Mol. Mass.:
813.963
SMILES:
NC(=N)c1ccc(CNC(=O)[C@@H]2Cc3cccc(CNC(=O)Cc4ccccc4CC(=O)NCc4cccc(C[C@@H](NS(=O)(=O)Cc5ccccc5)C(=O)N2)c4)c3)cc1
: