Target
Coagulation factor X
Ligand
BDBM50380622
Substrate
Meas. Tech.
Enzyme Assay
pH
8±n/a
Ki
3472±n/a nM
Comments
extracted
Citation
 Steinmetzer, TSaupe, SM Serine protease inhibitors US Patent  US8921319 Publication Date 12/30/2014 
Target
Name:
Coagulation factor X
Synonyms:
Activated coagulation factor X (FXa) Coagulation factor X precursor F10 Factor X heavy chain Factor Xa Stuart-Prower factor
Type:
Enzyme
Mol. Mass.:
54726.60
Organism:
Homo sapiens (Human)
Description:
Residue:
488
  
Inhibitor
Name:
BDBM50380622
Synonyms:
CHEMBL2016867
Type:
Small organic molecule
Emp. Form.:
C43H51N9O6S
Mol. Mass.:
821.987
SMILES:
NC(=N)c1ccc(CNC(=O)[C@@H]2Cc3ccc(CNC(=O)CN4CCN(CC4)CC(=O)NCc4ccc(C[C@@H](NS(=O)(=O)Cc5ccccc5)C(=O)N2)cc4)cc3)cc1
: