Target
EF-hand calcium-binding domain-containing protein 4B
Ligand
BDBM141427
Substrate
Meas. Tech.
In-Vitro Inhibition Assay
Temperature
310.15±n/a K
IC50
147.2±n/a nM
Comments
extracted
Citation
 Muthuppalaniappan, MViswanadha, SMerikapudi, GSVakkalanka, SK Modulators of calcium release-activated calcium channel US Patent  US8921364 Publication Date 12/30/2014 
Target
Name:
EF-hand calcium-binding domain-containing protein 4B
Synonyms:
CRACR2A EFC4B_HUMAN RAB46
Type:
Protein
Mol. Mass.:
45570.29
Organism:
Homo sapiens (Human)
Description:
Q9BSW2
Residue:
395
  
Inhibitor
Name:
BDBM141427
Synonyms:
US10668051, Compound Example 86 | US8921364, 86
Type:
Small organic molecule
Emp. Form.:
C21H17F4N3O
Mol. Mass.:
403.3728
SMILES:
Cc1ccccc1C(=O)Nc1ccc(c(F)c1)-n1nc(cc1C1CC1)C(F)(F)F
: